Reaction Details
TargetToll-like receptor 8
LigandBDBM273230
Substrate/Competitorn/a
Meas. Tech.TLR7/8/9 Inhibition Reporter Assay
Temperature298.15±n/a K
IC50 0.700±n/a nM
Commentsextracted
Citation Dyckman, AJDodd, DSMacor, JEMussari, CPPasunoori, LKumar, SRSherwood, TCSistla, RK [1,2,4]triazolo[1,5-a]pyridinyl substituted indole compounds US Patent US10071079 Publication Date 9/11/2018
 
Toll-like receptor 8
Name:Toll-like receptor 8
Type:Enzyme
Mol. Mass.:119828.77
Organism:Homo sapiens (Human)
Description:Q9NR97
Residue:1041
BDBM273230
NameBDBM273230
Synonyms:6-(3-isopropyl-5-(piperidin-4-yl)-1H-indol-2-yl)-7,8-dimethyl-[1,2,4]triazolo[1,5-a]pyridine dihydrochloride US10478424, Example 4
TypeSmall organic molecule
Emp. Form.C24H29N5
Mol. Mass.387.5206
SMILESCC(C)c1c([nH]c2ccc(cc12)C1CCNCC1)-c1cn2ncnc2c(C)c1C