Reaction Details
TargetAlpha-1B adrenergic receptor
LigandBDBM84440
Substrate/Competitorn/a
Meas. Tech.Binding Assay
Ki 54.5±0.0 nM
Citation Hendrix, JAShimshock, SJShutske, GMTomer, JDKapples, KJPalermo, MGCorbett, TJVargas, HMKafka, SBrooks, KMLaws-Ricker, LLee, DKde Lannoy, IBordeleau, MRizkalla, GOwolabi, JKamboj, RK Synthesis and structure-activity relationship of the isoindolinyl benzisoxazolpiperidines as potent, selective, and orally active human dopamine D4 receptor antagonists. Chembiochem3:999-1009 (2002) 
 
Alpha-1B adrenergic receptor
Name:Alpha-1B adrenergic receptor
Type:G Protein-Coupled Receptor (GPCR)
Mol. Mass.:56606.71
Organism:Rattus norvegicus (rat)
Description:Receptor binding assays were performed using rat cortical membranes.
Residue:515
BDBM84440
NameBDBM84440
Synonyms:Isoindoline, 7 Isoindoline, 9
TypeSmall organic molecule
Emp. Form.C23H26FN3O2
Mol. Mass.395.4698
SMILESOCC(CN1Cc2ccccc2C1)N1CCC(CC1)c1noc2cc(F)ccc12