Reaction Details
Target5-hydroxytryptamine receptor 7
LigandBDBM35234
Substrate/Competitorn/a
Ki 1000±n/a nM
CommentsPDSP_1348
Citation Shen, YMonsma, FJMetcalf, MAJose, PAHamblin, MWSibley, DR Molecular cloning and expression of a 5-hydroxytryptamine7 serotonin receptor subtype. J Biol Chem268:18200-4 (1993) 5-hydroxytryptamine receptor 7
Name:5-hydroxytryptamine receptor 7
Type:G Protein-Coupled Receptor (GPCR)
Mol. Mass.:49852.62
Organism:Rattus norvegicus (rat)
Description:Rat cloned 5-HT7R.
Residue:448
BDBM35234
NameBDBM35234
Synonyms:DL-[7-3H]norepinephrine Noradrenaline,(+) | [3H]NE
Typeradiolabeled ligand
Emp. Form.C8H11NO3
Mol. Mass.169.1778
SMILESNCC(O)c1ccc(O)c(O)c1