Reaction Details
TargetDNA (cytosine-5)-methyltransferase 1
LigandBDBM50239286
Substrate/Competitorn/a
Meas. Tech.ChEMBL_1665873 (CHEMBL4015669)
EC50 32000±n/a nM
Citation Halby, LMenon, YRilova, EPechalrieu, DMasson, VFaux, CBouhlel, MADavid-Cordonnier, MHNovosad, NAussagues, YSamson, ALacroix, LAusseil, FFleury, LGuianvarc'h, DFerroud, CArimondo, PB Rational Design of Bisubstrate-Type Analogues as Inhibitors of DNA Methyltransferases in Cancer Cells. J Med Chem60:4665-4679 (2017) 
 
DNA (cytosine-5)-methyltransferase 1
Name:DNA (cytosine-5)-methyltransferase 1
Type:Enzyme
Mol. Mass.:183184.85
Organism:Homo sapiens (Human)
Description:P26358
Residue:1616
BDBM50239286
NameBDBM50239286
Synonyms:CHEMBL4084601
TypeSmall organic molecule
Emp. Form.C33H36N6O
Mol. Mass.532.6785
SMILESC(CN1CCC(COc2ccc3c(NCCc4ccccc4)ncnc3c2)CC1)Nc1ccnc2ccccc12