Reaction Details
TargetDNA (cytosine-5)-methyltransferase 1
LigandBDBM50239288
Substrate/Competitorn/a
Meas. Tech.ChEMBL_1665873 (CHEMBL4015669)
EC50 26000±n/a nM
Citation Halby, LMenon, YRilova, EPechalrieu, DMasson, VFaux, CBouhlel, MADavid-Cordonnier, MHNovosad, NAussagues, YSamson, ALacroix, LAusseil, FFleury, LGuianvarc'h, DFerroud, CArimondo, PB Rational Design of Bisubstrate-Type Analogues as Inhibitors of DNA Methyltransferases in Cancer Cells. J Med Chem60:4665-4679 (2017) 
 
DNA (cytosine-5)-methyltransferase 1
Name:DNA (cytosine-5)-methyltransferase 1
Type:Enzyme
Mol. Mass.:183184.85
Organism:Homo sapiens (Human)
Description:P26358
Residue:1616
BDBM50239288
NameBDBM50239288
Synonyms:CHEMBL4097685
TypeSmall organic molecule
Emp. Form.C33H35ClN6O
Mol. Mass.567.124
SMILESClc1ccc(CCNc2ncnc3cc(OCC4CCN(CCNc5ccnc6ccccc56)CC4)ccc23)cc1