Reaction Details
TargetDNA (cytosine-5)-methyltransferase 1
LigandBDBM50239290
Substrate/Competitorn/a
Meas. Tech.ChEMBL_1665873 (CHEMBL4015669)
EC50 100000±n/a nM
Citation Halby, LMenon, YRilova, EPechalrieu, DMasson, VFaux, CBouhlel, MADavid-Cordonnier, MHNovosad, NAussagues, YSamson, ALacroix, LAusseil, FFleury, LGuianvarc'h, DFerroud, CArimondo, PB Rational Design of Bisubstrate-Type Analogues as Inhibitors of DNA Methyltransferases in Cancer Cells. J Med Chem60:4665-4679 (2017) 
 
DNA (cytosine-5)-methyltransferase 1
Name:DNA (cytosine-5)-methyltransferase 1
Type:Enzyme
Mol. Mass.:183184.85
Organism:Homo sapiens (Human)
Description:P26358
Residue:1616
BDBM50239290
NameBDBM50239290
Synonyms:CHEMBL4099197
TypeSmall organic molecule
Emp. Form.C38H38N6O
Mol. Mass.594.7479
SMILESC(CN1CCC(COc2ccc3c(NCc4ccc(cc4)-c4ccccc4)ncnc3c2)CC1)Nc1ccnc2ccccc12