Reaction Details
TargetDNA (cytosine-5)-methyltransferase 3A
LigandBDBM50239294
Substrate/Competitorn/a
Meas. Tech.ChEMBL_1665874 (CHEMBL4015670)
EC50 1000±n/a nM
Citation Halby, LMenon, YRilova, EPechalrieu, DMasson, VFaux, CBouhlel, MADavid-Cordonnier, MHNovosad, NAussagues, YSamson, ALacroix, LAusseil, FFleury, LGuianvarc'h, DFerroud, CArimondo, PB Rational Design of Bisubstrate-Type Analogues as Inhibitors of DNA Methyltransferases in Cancer Cells. J Med Chem60:4665-4679 (2017) 
 
DNA (cytosine-5)-methyltransferase 3A
Name:DNA (cytosine-5)-methyltransferase 3A
Type:PROTEIN
Mol. Mass.:101857.24
Organism:Homo sapiens (Human)
Description:ChEMBL_1510405
Residue:912
BDBM50239294
NameBDBM50239294
Synonyms:CHEMBL4070517
TypeSmall organic molecule
Emp. Form.C33H35ClN6O
Mol. Mass.567.124
SMILESClc1cccc(CCNc2ncnc3cc(OCC4CCN(CCNc5ccnc6ccccc56)CC4)ccc23)c1