Reaction Details
TargetLymphocyte antigen 96
LigandBDBM50239336
Substrate/Competitorn/a
Meas. Tech.ChEMBL_1665929 (CHEMBL4015725)
IC50 10000±n/a nM
Citation Sestito, SEFacchini, FAMorbioli, IBillod, JMMartin-Santamaria, SCasnati, ASansone, FPeri, F Amphiphilic Guanidinocalixarenes Inhibit Lipopolysaccharide (LPS)- and Lectin-Stimulated Toll-like Receptor 4 (TLR4) Signaling. J Med Chem60:4882-4892 (2017) 
 
Lymphocyte antigen 96
Name:Lymphocyte antigen 96
Type:PROTEIN
Mol. Mass.:18551.39
Organism:Homo sapiens (Human)
Description:ChEMBL_107939
Residue:160
BDBM50239336
NameBDBM50239336
Synonyms:CHEMBL4093531
TypeSmall organic molecule
Emp. Form.C60H96Cl4N12O4
Mol. Mass.1191.294
SMILESCl.Cl.Cl.Cl.CC(C)(C)c1cc2Cc3cc(cc(Cc4cc(cc(Cc5cc(cc(Cc(c1)c2OCCCNC(N)=N)c5OCCCNC(N)=N)C(C)(C)C)c4OCCCNC(N)=N)C(C)(C)C)c3OCCCNC(N)=N)C(C)(C)C