Reaction Details
TargetBaculoviral IAP repeat-containing protein 2
LigandBDBM156086
Substrate/Competitorn/a
Meas. Tech.ChEMBL_1666043 (CHEMBL4015839)
IC50 14±n/a nM
Citation Tamanini, EBuck, IMChessari, GChiarparin, EDay, JEHFrederickson, MGriffiths-Jones, CMHearn, KHeightman, TDIqbal, AJohnson, CNLewis, EJMartins, VPeakman, TReader, MRich, SJWard, GAWilliams, PAWilsher, NE Discovery of a Potent Nonpeptidomimetic, Small-Molecule Antagonist of Cellular Inhibitor of Apoptosis Protein 1 (cIAP1) and X-Linked Inhibitor of Apoptosis Protein (XIAP). J Med Chem60:4611-4625 (2017) 
 
Baculoviral IAP repeat-containing protein 2
Name:Baculoviral IAP repeat-containing protein 2
Type:Protein
Mol. Mass.:69900.47
Organism:Homo sapiens (Human)
Description:Q13490
Residue:618
BDBM156086
NameBDBM156086
Synonyms:US9018214, 137
TypeSmall organic molecule
Emp. Form.C25H34N4O2
Mol. Mass.422.5631
SMILESCOC[C@H]1CN[C@H](C)CN1CC(=O)N1CC(C)(C)c2ncc(Cc3ccccc3)cc12