Reaction Details
TargetDiacylglycerol O-acyltransferase 1
LigandBDBM50239484
Substrate/Competitorn/a
Meas. Tech.ChEMBL_1666098 (CHEMBL4015894)
IC50 23±n/a nM
Citation Nakajima, KChatelain, RClairmont, KBCommerford, RCoppola, GMDaniels, TForster, CJGilmore, TAGong, YJain, MKanter, AKwak, YLi, JMeyers, CDNeubert, ADSzklennik, PTedesco, VThompson, JTruong, DYang, QHubbard, BKSerrano-Wu, MH Discovery of an Orally Bioavailable Benzimidazole Diacylglycerol Acyltransferase 1 (DGAT1) Inhibitor That Suppresses Body Weight Gain in Diet-Induced Obese Dogs and Postprandial Triglycerides in Humans. J Med Chem60:4657-4664 (2017) 
 
Diacylglycerol O-acyltransferase 1
Name:Diacylglycerol O-acyltransferase 1
Type:Protein
Mol. Mass.:55297.82
Organism:Homo sapiens (Human)
Description:O75907
Residue:488
BDBM50239484
NameBDBM50239484
Synonyms:CHEMBL4103025
TypeSmall organic molecule
Emp. Form.C22H14Cl2N4O2
Mol. Mass.437.278
SMILESCOc1ccc(cc1)-c1nnc(o1)-c1ccc2nc([nH]c2c1)-c1c(Cl)cccc1Cl