Reaction Details
TargetCollagenase 3
LigandBDBM50239952
Substrate/Competitorn/a
Meas. Tech.ChEMBL_1667616 (CHEMBL4017412)
IC50 8.3±n/a nM
Citation Choi, JYFuerst, RKnapinska, AMTaylor, ABSmith, LCao, XHart, PJFields, GBRoush, WR Structure-Based Design and Synthesis of Potent and Selective Matrix Metalloproteinase 13 Inhibitors. J Med Chem60:5816-5825 (2017) 
 
Collagenase 3
Name:Collagenase 3
Type:Enzyme
Mol. Mass.:53808.06
Organism:Homo sapiens (Human)
Description:P45452
Residue:471
BDBM50239952
NameBDBM50239952
Synonyms:CHEMBL4081997
TypeSmall organic molecule
Emp. Form.C22H24N4O3S2
Mol. Mass.456.581
SMILESNCCNS(=O)(=O)c1ccc(cc1)-c1ccc(CSc2nc3CCCc3c(=O)[nH]2)cc1