Reaction Details
TargetCollagenase 3
LigandBDBM50239954
Substrate/Competitorn/a
Meas. Tech.ChEMBL_1667616 (CHEMBL4017412)
IC50 8.1±n/a nM
Citation Choi, JYFuerst, RKnapinska, AMTaylor, ABSmith, LCao, XHart, PJFields, GBRoush, WR Structure-Based Design and Synthesis of Potent and Selective Matrix Metalloproteinase 13 Inhibitors. J Med Chem60:5816-5825 (2017) 
 
Collagenase 3
Name:Collagenase 3
Type:Enzyme
Mol. Mass.:53808.06
Organism:Homo sapiens (Human)
Description:P45452
Residue:471
BDBM50239954
NameBDBM50239954
Synonyms:CHEMBL4080520
TypeSmall organic molecule
Emp. Form.C25H27FN4O4S
Mol. Mass.498.57
SMILESCNC(=O)[C@@H](NC(=O)c1ccc(o1)-c1ccc(CSc2nc3CCCc3c(=O)[nH]2)c(F)c1)C(C)C