Reaction Details
TargetCollagenase 3
LigandBDBM50239951
Substrate/Competitorn/a
Meas. Tech.ChEMBL_1667601 (CHEMBL4017397)
Ki 9.2±n/a nM
Citation Choi, JYFuerst, RKnapinska, AMTaylor, ABSmith, LCao, XHart, PJFields, GBRoush, WR Structure-Based Design and Synthesis of Potent and Selective Matrix Metalloproteinase 13 Inhibitors. J Med Chem60:5816-5825 (2017) 
 
Collagenase 3
Name:Collagenase 3
Type:Enzyme
Mol. Mass.:53808.06
Organism:Homo sapiens (Human)
Description:P45452
Residue:471
BDBM50239951
NameBDBM50239951
Synonyms:CHEMBL4100008
TypeSmall organic molecule
Emp. Form.C22H23N3O4S2
Mol. Mass.457.566
SMILESOCCNS(=O)(=O)c1ccc(cc1)-c1ccc(CSc2nc3CCCc3c(=O)[nH]2)cc1