Reaction Details
TargetBile salt export pump
LigandBDBM50343352
Substrate/Competitorn/a
Meas. Tech.ChEMBL_1667662 (CHEMBL4017550)
IC50 115300±n/a nM
Citation Warner, DJChen, HCantin, LDKenna, JGStahl, SWalker, CLNoeske, T Mitigating the inhibition of human bile salt export pump by drugs: opportunities provided by physicochemical property modulation, in silico modeling, and structural modification. Drug Metab Dispos40:2332-41 (2012) 
 
Bile salt export pump
Name:Bile salt export pump
Type:Protein
Mol. Mass.:146405.49
Organism:Homo sapiens (Human)
Description:O95342
Residue:1321
BDBM50343352
NameBDBM50343352
Synonyms:2-hydroxy-3-(3-oxo-1-phenylbutyl)-4H-chromen-4-one 4-Hydroxy-3-(3-oxo-1-phenyl-butyl)-chromen-2-one CHEMBL1464 Jantoven wafarin warfarine
TypeSmall organic molecule
Emp. Form.C19H16O4
Mol. Mass.308.3279
SMILESCC(=O)CC(c1ccccc1)c1c(O)c2ccccc2oc1=O