Reaction Details
TargetProlyl 4-hydroxylase subunit alpha-1
LigandBDBM26106
Substrate/Competitorn/a
Meas. Tech.ChEMBL_157457 (CHEMBL765597)
IC50 2890±n/a nM
Citation Cunliffe, CJFranklin, TJHales, NJHill, GB Novel inhibitors of prolyl 4-hydroxylase. 3. Inhibition by the substrate analogue N-oxaloglycine and its derivatives. J Med Chem35:2652-8 (1992) Prolyl 4-hydroxylase subunit alpha-1
Name:Prolyl 4-hydroxylase subunit alpha-1
Type:PROTEIN
Mol. Mass.:60891.28
Organism:Rattus norvegicus
Description:ChEMBL_157460
Residue:534
BDBM26106
NameBDBM26106
Synonyms:CHEMBL90852 NOG [(carboxymethyl)carbamoyl]formic acid
TypeSmall organic molecule
Emp. Form.C4H5NO5
Mol. Mass.147.0862
SMILESOC(=O)CNC(=O)C(O)=O