Reaction Details
TargetProlyl 4-hydroxylase subunit alpha-1
LigandBDBM50000865
Substrate/Competitorn/a
Meas. Tech.ChEMBL_157457 (CHEMBL765597)
IC50 90700±n/a nM
Citation Cunliffe, CJFranklin, TJHales, NJHill, GB Novel inhibitors of prolyl 4-hydroxylase. 3. Inhibition by the substrate analogue N-oxaloglycine and its derivatives. J Med Chem35:2652-8 (1992) Prolyl 4-hydroxylase subunit alpha-1
Name:Prolyl 4-hydroxylase subunit alpha-1
Type:PROTEIN
Mol. Mass.:60891.28
Organism:Rattus norvegicus
Description:ChEMBL_157460
Residue:534
BDBM50000865
NameBDBM50000865
Synonyms:2-(Oxalyl-amino)-propionic acid | CHEMBL314979
TypeSmall organic molecule
Emp. Form.C5H7NO5
Mol. Mass.161.1128
SMILESCC(NC(=O)C(O)=O)C(O)=O