Reaction Details
TargetDNA topoisomerase 2-alpha
LigandBDBM22984
Substrate/Competitorn/a
Meas. Tech.ChEMBL_1667749 (CHEMBL4017637)
IC50 3000±n/a nM
Citation Zoidis, GSosic, ADa Ros, SGatto, BSissi, CPalluotto, FCarotti, ACatto, M Indenocinnoline derivatives as G-quadruplex binders, topoisomerase II? inhibitors and antiproliferative agents. Bioorg Med Chem25:2625-2634 (2017) 
 
DNA topoisomerase 2-alpha
Name:DNA topoisomerase 2-alpha
Type:Protein
Mol. Mass.:174415.30
Organism:Homo sapiens (Human)
Description:P11388
Residue:1531
BDBM22984
NameBDBM22984
Synonyms:(8S,10S)-10-{[(2R,4S,5S,6S)-4-amino-5-hydroxy-6-methyloxan-2-yl]oxy}-6,8,11-trihydroxy-8-(2-hydroxyacetyl)-1-methoxy-5,7,8,9,10,12-hexahydrotetracene-5,12-dione Adriblastina Doxil | Doxorubicin
TypeAntibiotic
Emp. Form.C27H29NO11
Mol. Mass.543.5193
SMILESCOc1cccc2C(=O)c3c(O)c4C[C@](O)(C[C@H](O[C@H]5C[C@H](N)[C@H](O)[C@H](C)O5)c4c(O)c3C(=O)c12)C(=O)CO