Reaction Details
TargetFocal adhesion kinase 1
LigandBDBM50240195
Substrate/Competitorn/a
Meas. Tech.ChEMBL_1667787 (CHEMBL4017675)
IC50 1120±n/a nM
Citation Sun, JRen, SZLu, XYLi, JJShen, FQXu, CZhu, HL Discovery of a series of 1,3,4-oxadiazole-2(3H)-thione derivatives containing piperazine skeleton as potential FAK inhibitors. Bioorg Med Chem25:2593-2600 (2017) 
 
Focal adhesion kinase 1
Name:Focal adhesion kinase 1
Type:Tyrosine-protein kinase
Mol. Mass.:119233.17
Organism:Homo sapiens (Human)
Description:Q05397
Residue:1052
BDBM50240195
NameBDBM50240195
Synonyms:CHEMBL4068178
TypeSmall organic molecule
Emp. Form.C28H28N4O3S
Mol. Mass.500.612
SMILESS=c1oc(nn1CN1CCN(CC1)C(c1ccccc1)c1ccccc1)-c1ccc2OCCOc2c1