Reaction Details
TargetFocal adhesion kinase 1
LigandBDBM50240198
Substrate/Competitorn/a
Meas. Tech.ChEMBL_1667787 (CHEMBL4017675)
IC50 780±n/a nM
Citation Sun, JRen, SZLu, XYLi, JJShen, FQXu, CZhu, HL Discovery of a series of 1,3,4-oxadiazole-2(3H)-thione derivatives containing piperazine skeleton as potential FAK inhibitors. Bioorg Med Chem25:2593-2600 (2017) 
 
Focal adhesion kinase 1
Name:Focal adhesion kinase 1
Type:Tyrosine-protein kinase
Mol. Mass.:119233.17
Organism:Homo sapiens (Human)
Description:Q05397
Residue:1052
BDBM50240198
NameBDBM50240198
Synonyms:CHEMBL4066053
TypeSmall organic molecule
Emp. Form.C22H21F3N4O3S
Mol. Mass.478.487
SMILESFC(F)(F)c1cccc(c1)N1CCN(Cn2nc(oc2=S)-c2ccc3OCCOc3c2)CC1