Reaction Details
TargetDelta-type opioid receptor
LigandBDBM50001456
Substrate/Competitorn/a
Meas. Tech.ChEBML_146595
Ki 0.665000±n/a nM
Citation Schiller, PWWeltrowska, GNguyen, TMWilkes, BCChung, NNLemieux, C Conformationally restricted deltorphin analogues. J Med Chem35:3956-61 (1992) Delta-type opioid receptor
Name:Delta-type opioid receptor
Type:G Protein-Coupled Receptor (GPCR)
Mol. Mass.:40465.04
Organism:Rattus norvegicus (rat)
Description:Competition binding assays were using CHO-K1 cell membranes expressing the opioid receptor.
Residue:372
BDBM50001456
NameBDBM50001456
Synonyms:3-(2-{2-[2-(2-{2-[2-Amino-3-(4-hydroxy-phenyl)-propionylamino]-hexanoylamino}-3-phenyl-propionylamino)-3-(3H-imidazol-4-yl)-propionylamino]-4-methyl-pentanoylamino}-hexanoylamino)-succinamic acid | CHEMBL436590
TypeSmall organic molecule
Emp. Form.C46H66N10O10
Mol. Mass.919.0772
SMILESCCCC[C@@H](NC(=O)[C@@H](N)Cc1ccc(O)cc1)C(=O)N[C@@H](Cc1ccccc1)C(=O)N[C@@H](Cc1cnc[nH]1)C(=O)N[C@@H](CC(C)C)C(=O)N[C@@H](CCCC)C(=O)N[C@@H](CC(O)=O)C(N)=O