Reaction Details
TargetDelta-type opioid receptor
LigandBDBM50001462
Substrate/Competitorn/a
Meas. Tech.ChEBML_135591
IC50 0.080300±n/a nM
Citation Schiller, PWWeltrowska, GNguyen, TMWilkes, BCChung, NNLemieux, C Conformationally restricted deltorphin analogues. J Med Chem35:3956-61 (1992) Delta-type opioid receptor
Name:Delta-type opioid receptor
Type:Enzyme Catalytic Domain
Mol. Mass.:40577.25
Organism:MOUSE
Description:P32300
Residue:372
BDBM50001462
NameBDBM50001462
Synonyms:3-[(2-{2-[2-Amino-3-(4-hydroxy-phenyl)-propionylamino]-propionylamino}-indane-2-carbonyl)-amino]-N-{1-[1-(carbamoylmethyl-carbamoyl)-2-methyl-propylcarbamoyl]-2-methyl-propyl}-succinamic acid H-Tyr-D-Ala-Aic-Asp-Val-Val-Gly-NH2
TypeSmall organic molecule
Emp. Form.C38H52N8O10
Mol. Mass.780.8671
SMILESCC(C)[C@H](NC(=O)[C@@H](NC(=O)[C@H](CC(O)=O)NC(=O)C1(Cc2ccccc2C1)NC(=O)[C@@H](C)NC(=O)[C@@H](N)Cc1ccc(O)cc1)C(C)C)C(=O)NCC(N)=O