Reaction Details
TargetAdenosine receptor A1
LigandBDBM50001498
Substrate/Competitorn/a
Meas. Tech.ChEBML_29284
Ki 3000±n/a nM
Citation Sakai, RKonno, KYamamoto, YSanae, FTakagi, KHasegawa, TIwasaki, NKakiuchi, MKato, HMiyamoto, K Effects of alkyl substitutions of xanthine skeleton on bronchodilation. J Med Chem35:4039-44 (1992) Adenosine receptor A1
Name:Adenosine receptor A1
Type:Enzyme Catalytic Domain
Mol. Mass.:36501.39
Organism:GUINEA PIG
Description:ADENOSINE A1 ADORA1 GUINEA PIG::P47745
Residue:326
BDBM50001498
NameBDBM50001498
Synonyms:1-Butyl-3,7-dihydro-purine-2,6-dione | CHEMBL68278
TypeSmall organic molecule
Emp. Form.C9H12N4O2
Mol. Mass.208.2172
SMILESCCCCn1c(=O)[nH]c2nc[nH]c2c1=O