Reaction Details
TargetAdenosine receptor A1
LigandBDBM50001503
Substrate/Competitorn/a
Meas. Tech.ChEBML_29284
Ki 11800±n/a nM
Citation Sakai, RKonno, KYamamoto, YSanae, FTakagi, KHasegawa, TIwasaki, NKakiuchi, MKato, HMiyamoto, K Effects of alkyl substitutions of xanthine skeleton on bronchodilation. J Med Chem35:4039-44 (1992) Adenosine receptor A1
Name:Adenosine receptor A1
Type:Enzyme Catalytic Domain
Mol. Mass.:36501.39
Organism:GUINEA PIG
Description:ADENOSINE A1 ADORA1 GUINEA PIG::P47745
Residue:326
BDBM50001503
NameBDBM50001503
Synonyms:1-Ethyl-7-methyl-3-propyl-3,7-dihydro-purine-2,6-dione | CHEMBL132052
TypeSmall organic molecule
Emp. Form.C11H16N4O2
Mol. Mass.236.2703
SMILESCCCn1c2ncn(C)c2c(=O)n(CC)c1=O