Reaction Details
TargetAdenosine receptor A2a
LigandBDBM50001516
Substrate/Competitorn/a
Meas. Tech.ChEBML_27629
Ki 4100±n/a nM
Citation Sakai, RKonno, KYamamoto, YSanae, FTakagi, KHasegawa, TIwasaki, NKakiuchi, MKato, HMiyamoto, K Effects of alkyl substitutions of xanthine skeleton on bronchodilation. J Med Chem35:4039-44 (1992) Adenosine receptor A2a
Name:Adenosine receptor A2a
Type:Enzyme Catalytic Domain
Mol. Mass.:44955.08
Organism:GUINEA PIG
Description:ADENOSINE A2 0 GUINEA PIG::P46616
Residue:409
BDBM50001516
NameBDBM50001516
Synonyms:1-Butyl-3-propyl-3,7-dihydro-purine-2,6-dione | CHEMBL446679
TypeSmall organic molecule
Emp. Form.C12H18N4O2
Mol. Mass.250.2969
SMILESCCCCn1c(=O)n(CCC)c2nc[nH]c2c1=O