Reaction Details
TargetAdenosine receptor A1
LigandBDBM50001517
Substrate/Competitorn/a
Meas. Tech.ChEBML_29284
Ki 9800±n/a nM
Citation Sakai, RKonno, KYamamoto, YSanae, FTakagi, KHasegawa, TIwasaki, NKakiuchi, MKato, HMiyamoto, K Effects of alkyl substitutions of xanthine skeleton on bronchodilation. J Med Chem35:4039-44 (1992) Adenosine receptor A1
Name:Adenosine receptor A1
Type:Enzyme Catalytic Domain
Mol. Mass.:36501.39
Organism:GUINEA PIG
Description:ADENOSINE A1 ADORA1 GUINEA PIG::P47745
Residue:326
BDBM50001517
NameBDBM50001517
Synonyms:1-Ethyl-3,7-dihydro-purine-2,6-dione | CHEMBL127167
TypeSmall organic molecule
Emp. Form.C7H8N4O2
Mol. Mass.180.164
SMILESCCn1c(=O)[nH]c2nc[nH]c2c1=O