Reaction Details
TargetVasopressin V1a receptor
LigandBDBM50044676
Substrate/Competitorn/a
Meas. Tech.ChEMBL_1668475 (CHEMBL4018363)
EC50 3.20±n/a nM
Citation Adachi, YSakimura, KShimizu, YNakayama, MTerao, YYano, TAsami, T Potent and selective oxytocin receptor agonists without disulfide bridges. Bioorg Med Chem Lett27:2331-2335 (2017) 
 
Vasopressin V1a receptor
Name:Vasopressin V1a receptor
Type:Receptor
Mol. Mass.:46820.18
Organism:Homo sapiens (Human)
Description:P37288
Residue:418
BDBM50044676
NameBDBM50044676
Synonyms:CHEMBL439044
TypeSmall organic molecule
Emp. Form.C43H65N11O12S2
Mol. Mass.992.173
SMILES[H][C@]1(NC(=O)[C@H](Cc2ccc(O)cc2)NC(=O)CCSSC[C@H](NC(=O)[C@H](CC(N)=O)NC(=O)[C@H](CCC(N)=O)NC1=O)C(=O)N1CCC[C@H]1C(=O)N[C@@H](CC(C)C)C(=O)NCC(N)=O)[C@@H](C)CC