Reaction Details
TargetELAV-like protein 1
LigandBDBM50745
Substrate/Competitorn/a
Meas. Tech.ChEMBL_1668504 (CHEMBL4018392)
IC50 12200±n/a nM
Citation Nasti, RRossi, DAmadio, MPascale, AUnver, MYHirsch, AKHCollina, S Compounds Interfering with Embryonic Lethal Abnormal Vision (ELAV) Protein-RNA Complexes: An Avenue for Discovering New Drugs. J Med Chem60:8257-8267 (2017) 
 
ELAV-like protein 1
Name:ELAV-like protein 1
Type:PROTEIN
Mol. Mass.:36102.56
Organism:Homo sapiens (Human)
Description:ChEMBL_654855
Residue:326
BDBM50745
NameBDBM50745
Synonyms:3-(5,7-dimethoxy-2-oxidanylidene-4-phenyl-chromen-8-yl)-N,N-diethyl-3-(3,4,5-trimethoxyphenyl)propanamide 3-(5,7-dimethoxy-2-oxo-4-phenylchromen-8-yl)-N,N-diethyl-3-(3,4,5-trimethoxyphenyl)propanamide N,N-diethyl-3-(2-keto-5,7-dimethoxy-4-phenyl-chromen-8-yl)-3-(3,4,5-trimethoxyphenyl)propionamide cid_16746297
TypeSmall organic molecule
Emp. Form.C33H37NO8
Mol. Mass.575.6488
SMILESCCN(CC)C(=O)CC(c1cc(OC)c(OC)c(OC)c1)c1c(OC)cc(OC)c2c(cc(=O)oc12)-c1ccccc1