Reaction Details
TargetELAV-like protein 1
LigandBDBM50240684
Substrate/Competitorn/a
Meas. Tech.ChEMBL_1668503 (CHEMBL4018391)
Ki 1050±n/a nM
Citation Nasti, RRossi, DAmadio, MPascale, AUnver, MYHirsch, AKHCollina, S Compounds Interfering with Embryonic Lethal Abnormal Vision (ELAV) Protein-RNA Complexes: An Avenue for Discovering New Drugs. J Med Chem60:8257-8267 (2017) 
 
ELAV-like protein 1
Name:ELAV-like protein 1
Type:PROTEIN
Mol. Mass.:36102.56
Organism:Homo sapiens (Human)
Description:ChEMBL_654855
Residue:326
BDBM50240684
NameBDBM50240684
Synonyms:CHEMBL1309685
TypeSmall organic molecule
Emp. Form.C31H29NO7
Mol. Mass.527.5645
SMILESCOc1cc(OC)c2c(cc(=O)oc2c1C(CC(=O)N1CCCC1)c1ccc2OCOc2c1)-c1ccccc1