Reaction Details
TargetELAV-like protein 1
LigandBDBM50746
Substrate/Competitorn/a
Meas. Tech.ChEMBL_1668503 (CHEMBL4018391)
IC50 2400±n/a nM
Citation Nasti, RRossi, DAmadio, MPascale, AUnver, MYHirsch, AKHCollina, S Compounds Interfering with Embryonic Lethal Abnormal Vision (ELAV) Protein-RNA Complexes: An Avenue for Discovering New Drugs. J Med Chem60:8257-8267 (2017) 
 
ELAV-like protein 1
Name:ELAV-like protein 1
Type:PROTEIN
Mol. Mass.:36102.56
Organism:Homo sapiens (Human)
Description:ChEMBL_654855
Residue:326
BDBM50746
NameBDBM50746
Synonyms:5,7-dimethoxy-8-[1-(4-methoxyphenyl)-3-oxidanylidene-3-pyrrolidin-1-yl-propyl]-4-phenyl-chromen-2-one 5,7-dimethoxy-8-[1-(4-methoxyphenyl)-3-oxo-3-pyrrolidin-1-ylpropyl]-4-phenylchromen-2-one MLS000879470 cid_16746438
TypeSmall organic molecule
Emp. Form.C31H31NO6
Mol. Mass.513.5809
SMILESCOc1ccc(cc1)C(CC(=O)N1CCCC1)c1c(OC)cc(OC)c2c(cc(=O)oc12)-c1ccccc1