Reaction Details
TargetELAV-like protein 1
LigandBDBM50423877
Substrate/Competitorn/a
Meas. Tech.ChEMBL_1668502 (CHEMBL4018390)
IC50 68±n/a nM
Citation Nasti, RRossi, DAmadio, MPascale, AUnver, MYHirsch, AKHCollina, S Compounds Interfering with Embryonic Lethal Abnormal Vision (ELAV) Protein-RNA Complexes: An Avenue for Discovering New Drugs. J Med Chem60:8257-8267 (2017) 
 
ELAV-like protein 1
Name:ELAV-like protein 1
Type:PROTEIN
Mol. Mass.:36102.56
Organism:Homo sapiens (Human)
Description:ChEMBL_654855
Residue:326
BDBM50423877
NameBDBM50423877
Synonyms:DIHYDROTANSHINONE acs.jmedchem.1c00409_ST.562
TypeSmall organic molecule
Emp. Form.C18H14O3
Mol. Mass.278.302
SMILESC[C@H]1COC2=C1C(=O)C(=O)c1c2ccc2c(C)cccc12