Reaction Details
TargetELAV-like protein 3
LigandBDBM15236
Substrate/Competitorn/a
Meas. Tech.ChEMBL_1668499 (CHEMBL4018387)
IC50 1000±n/a nM
Citation Nasti, RRossi, DAmadio, MPascale, AUnver, MYHirsch, AKHCollina, S Compounds Interfering with Embryonic Lethal Abnormal Vision (ELAV) Protein-RNA Complexes: An Avenue for Discovering New Drugs. J Med Chem60:8257-8267 (2017) 
 
ELAV-like protein 3
Name:ELAV-like protein 3
Type:PROTEIN
Mol. Mass.:39557.78
Organism:Homo sapiens
Description:ChEMBL_117529
Residue:367
BDBM15236
NameBDBM15236
Synonyms:3,5,7-trihydroxy-2-(3,4,5-trihydroxyphenyl)-4H-chromen-4-one CHEMBL164 Myricetin Myricetin (Myr) | cid_5281672
TypeSmall organic molecule
Emp. Form.C15H10O8
Mol. Mass.318.2351
SMILESOc1cc(O)c2c(c1)oc(-c1cc(O)c(O)c(O)c1)c(O)c2=O