Reaction Details
TargetELAV-like protein 1
LigandBDBM94953
Substrate/Competitorn/a
Meas. Tech.ChEMBL_1668505 (CHEMBL4018393)
IC50 44400±n/a nM
Citation Nasti, RRossi, DAmadio, MPascale, AUnver, MYHirsch, AKHCollina, S Compounds Interfering with Embryonic Lethal Abnormal Vision (ELAV) Protein-RNA Complexes: An Avenue for Discovering New Drugs. J Med Chem60:8257-8267 (2017) 
 
ELAV-like protein 1
Name:ELAV-like protein 1
Type:PROTEIN
Mol. Mass.:36102.56
Organism:Homo sapiens (Human)
Description:ChEMBL_654855
Residue:326
BDBM94953
NameBDBM94953
Synonyms:5-Amino-2-p-toluidinobenzenesulfonic acid 5-amino-2-(p-toluidino)besylic acid MLS000736579 cid_66672
TypeSmall organic molecule
Emp. Form.C13H14N2O3S
Mol. Mass.278.327
SMILESCc1ccc(Nc2ccc(N)cc2S(O)(=O)=O)cc1