Reaction Details
TargetELAV-like protein 1
LigandBDBM50240685
Substrate/Competitorn/a
Meas. Tech.ChEMBL_1668504 (CHEMBL4018392)
Ki 4600±n/a nM
Citation Nasti, RRossi, DAmadio, MPascale, AUnver, MYHirsch, AKHCollina, S Compounds Interfering with Embryonic Lethal Abnormal Vision (ELAV) Protein-RNA Complexes: An Avenue for Discovering New Drugs. J Med Chem60:8257-8267 (2017) 
 
ELAV-like protein 1
Name:ELAV-like protein 1
Type:PROTEIN
Mol. Mass.:36102.56
Organism:Homo sapiens (Human)
Description:ChEMBL_654855
Residue:326
BDBM50240685
NameBDBM50240685
Synonyms:CHEMBL1522581
TypeSmall organic molecule
Emp. Form.C31H33NO6
Mol. Mass.515.5968
SMILESCCN(CC)C(=O)CC(c1ccc(OC)cc1)c1c(OC)cc(OC)c2c(cc(=O)oc12)-c1ccccc1