Reaction Details
TargetELAV-like protein 3
LigandBDBM50240690
Substrate/Competitorn/a
Meas. Tech.ChEMBL_1668499 (CHEMBL4018387)
IC50 200±n/a nM
Citation Nasti, RRossi, DAmadio, MPascale, AUnver, MYHirsch, AKHCollina, S Compounds Interfering with Embryonic Lethal Abnormal Vision (ELAV) Protein-RNA Complexes: An Avenue for Discovering New Drugs. J Med Chem60:8257-8267 (2017) 
 
ELAV-like protein 3
Name:ELAV-like protein 3
Type:PROTEIN
Mol. Mass.:39557.78
Organism:Homo sapiens
Description:ChEMBL_117529
Residue:367
BDBM50240690
NameBDBM50240690
Synonyms:CHEMBL4088244
TypeSmall organic molecule
Emp. Form.C23H20O11
Mol. Mass.472.3983
SMILESCOc1cc(O)c2C[C@@H](OC(=O)c3cc(O)c(O)c(O)c3)[C@H](Oc2c1)c1cc(O)c(O)c(O)c1