Reaction Details
TargetELAV-like protein 1
LigandBDBM61111
Substrate/Competitorn/a
Meas. Tech.ChEMBL_1668503 (CHEMBL4018391)
Ki 1100±n/a nM
Citation Nasti, RRossi, DAmadio, MPascale, AUnver, MYHirsch, AKHCollina, S Compounds Interfering with Embryonic Lethal Abnormal Vision (ELAV) Protein-RNA Complexes: An Avenue for Discovering New Drugs. J Med Chem60:8257-8267 (2017) 
 
ELAV-like protein 1
Name:ELAV-like protein 1
Type:PROTEIN
Mol. Mass.:36102.56
Organism:Homo sapiens (Human)
Description:ChEMBL_654855
Residue:326
BDBM61111
NameBDBM61111
Synonyms:5,7-dimethoxy-8-[3-oxidanylidene-3-pyrrolidin-1-yl-1-(3,4,5-trimethoxyphenyl)propyl]-4-phenyl-chromen-2-one 5,7-dimethoxy-8-[3-oxo-3-pyrrolidin-1-yl-1-(3,4,5-trimethoxyphenyl)propyl]-4-phenylchromen-2-one MLS000879490 cid_16746465
TypeSmall organic molecule
Emp. Form.C33H35NO8
Mol. Mass.573.6329
SMILESCOc1cc(cc(OC)c1OC)C(CC(=O)N1CCCC1)c1c(OC)cc(OC)c2c(cc(=O)oc12)-c1ccccc1