Reaction Details
TargetCytochrome P450 2C8
LigandBDBM50397663
Substrate/Competitorn/a
Meas. Tech.ChEMBL_1668632 (CHEMBL4018520)
IC50 24000±n/a nM
Citation Ma, YFu, YKhojasteh, SCDalvie, DZhang, D Glucuronides as Potential Anionic Substrates of Human Cytochrome P450 2C8 (CYP2C8). J Med Chem60:8691-8705 (2017) 
 
Cytochrome P450 2C8
Name:Cytochrome P450 2C8
Type:Protein
Mol. Mass.:55839.23
Organism:Homo sapiens (Human)
Description:P10632
Residue:490
BDBM50397663
NameBDBM50397663
Synonyms:CHEMBL2181817
TypeSmall organic molecule
Emp. Form.C21H30O9
Mol. Mass.426.4575
SMILESCc1ccc(C)c(OCCCC(C)(C)C(=O)O[C@@H]2O[C@@H]([C@@H](O)[C@H](O)[C@H]2O)C(O)=O)c1