Reaction Details
TargetLeukotriene B4 receptor 1
LigandBDBM50001609
Substrate/Competitorn/a
Meas. Tech.ChEMBL_99848 (CHEMBL706919)
IC50 9±n/a nM
Citation Huang, FCChan, WKWarus, JDMorrissette, MMMoriarty, KJChang, MNTravis, JJMitchell, LSNuss, GWSutherland, CA 4-[2-[Methyl(2-phenethyl)amino]-2-oxoethyl]-8-(phenylmethoxy)-2- naphthalenecarboxylic acid: a high affinity, competitive, orally active leukotriene B4 receptor antagonist. J Med Chem35:4253-5 (1992) Leukotriene B4 receptor 1
Name:Leukotriene B4 receptor 1
Type:Enzyme Catalytic Domain
Mol. Mass.:37582.68
Organism:Homo sapiens (Human)
Description:Q15722
Residue:352
BDBM50001609
NameBDBM50001609
Synonyms:8-Benzyloxy-4-[(methyl-phenethyl-carbamoyl)-methyl]-naphthalene-2-carboxylic acid CHEMBL328712
TypeSmall organic molecule
Emp. Form.C29H27NO4
Mol. Mass.453.529
SMILESCN(CCc1ccccc1)C(=O)Cc1cc(cc2c(OCc3ccccc3)cccc12)C(O)=O