Reaction Details
TargetLeukotriene B4 receptor 1
LigandBDBM50001645
Substrate/Competitorn/a
Meas. Tech.ChEMBL_99487 (CHEMBL704375)
IC50 4±n/a nM
Citation Labaudinière, RDereu, NCavy, FGuillet, MCMarquis, OTerlain, B omega-[(4,6-Diphenyl-2-pyridyl)oxy]alkanoic acid derivatives: a new family of potent and orally active LTB4 antagonists. J Med Chem35:4315-24 (1992) Leukotriene B4 receptor 1
Name:Leukotriene B4 receptor 1
Type:Enzyme Catalytic Domain
Mol. Mass.:37582.68
Organism:Homo sapiens (Human)
Description:Q15722
Residue:352
BDBM50001645
NameBDBM50001645
Synonyms:6-[6-(2-Fluoro-phenyl)-4-phenyl-pyridin-2-yloxy]-2-methyl-hexanoic acid | CHEMBL344230
TypeSmall organic molecule
Emp. Form.C24H24FNO3
Mol. Mass.393.4507
SMILESCC(CCCCOc1cc(cc(n1)-c1ccccc1F)-c1ccccc1)C(O)=O