Reaction Details
TargetPlatelet-derived growth factor receptor beta
LigandBDBM50240779
Substrate/Competitorn/a
Meas. Tech.ChEMBL_1668753 (CHEMBL4018641)
IC50 1.000000±n/a nM
Citation Zhu, WChen, HWang, YWang, JPeng, XChen, XGao, YLi, CHe, YAi, JGeng, MZheng, MLiu, H Design, Synthesis, and Pharmacological Evaluation of Novel Multisubstituted Pyridin-3-amine Derivatives as Multitargeted Protein Kinase Inhibitors for the Treatment of Non-Small Cell Lung Cancer. J Med Chem60:6018-6035 (2017) 
 
Platelet-derived growth factor receptor beta
Name:Platelet-derived growth factor receptor beta
Type:Enzyme
Mol. Mass.:123922.25
Organism:Homo sapiens (Human)
Description:P09619
Residue:1106
BDBM50240779
NameBDBM50240779
Synonyms:CHEMBL4067871
TypeSmall organic molecule
Emp. Form.C28H22ClN3O2
Mol. Mass.467.946
SMILESOC[C@H](Nc1cnc(-c2cc(Cl)ccc2O)c(c1)-c1ccc2cnccc2c1)c1ccccc1