Reaction Details
TargetPlatelet-derived growth factor receptor beta
LigandBDBM50240780
Substrate/Competitorn/a
Meas. Tech.ChEMBL_1668753 (CHEMBL4018641)
IC50>10.0±n/a nM
Citation Zhu, WChen, HWang, YWang, JPeng, XChen, XGao, YLi, CHe, YAi, JGeng, MZheng, MLiu, H Design, Synthesis, and Pharmacological Evaluation of Novel Multisubstituted Pyridin-3-amine Derivatives as Multitargeted Protein Kinase Inhibitors for the Treatment of Non-Small Cell Lung Cancer. J Med Chem60:6018-6035 (2017) 
 
Platelet-derived growth factor receptor beta
Name:Platelet-derived growth factor receptor beta
Type:Enzyme
Mol. Mass.:123922.25
Organism:Homo sapiens (Human)
Description:P09619
Residue:1106
BDBM50240780
NameBDBM50240780
Synonyms:CHEMBL4062877
TypeSmall organic molecule
Emp. Form.C27H23FN4O2
Mol. Mass.454.4955
SMILESCc1n[nH]c2ccc(cc12)-c1cc(N[C@@H](CO)c2ccccc2)cnc1-c1cc(F)ccc1O