Reaction Details
TargetReceptor tyrosine-protein kinase erbB-2
LigandBDBM50240781
Substrate/Competitorn/a
Meas. Tech.ChEMBL_1668755 (CHEMBL4018643)
IC50 1.000000±n/a nM
Citation Zhu, WChen, HWang, YWang, JPeng, XChen, XGao, YLi, CHe, YAi, JGeng, MZheng, MLiu, H Design, Synthesis, and Pharmacological Evaluation of Novel Multisubstituted Pyridin-3-amine Derivatives as Multitargeted Protein Kinase Inhibitors for the Treatment of Non-Small Cell Lung Cancer. J Med Chem60:6018-6035 (2017) 
 
Receptor tyrosine-protein kinase erbB-2
Name:Receptor tyrosine-protein kinase erbB-2
Type:n/a
Mol. Mass.:137894.47
Organism:Homo sapiens (Human)
Description:P04626
Residue:1255
BDBM50240781
NameBDBM50240781
Synonyms:CHEMBL4105329
TypeSmall organic molecule
Emp. Form.C27H23ClN4O2
Mol. Mass.470.95
SMILESCc1n[nH]c2ccc(cc12)-c1cc(N[C@@H](CO)c2ccccc2)cnc1-c1cc(Cl)ccc1O