Reaction Details
TargetFibroblast growth factor receptor 2
LigandBDBM50240781
Substrate/Competitorn/a
Meas. Tech.ChEMBL_1668738 (CHEMBL4018626)
IC50 8.6±n/a nM
Citation Zhu, WChen, HWang, YWang, JPeng, XChen, XGao, YLi, CHe, YAi, JGeng, MZheng, MLiu, H Design, Synthesis, and Pharmacological Evaluation of Novel Multisubstituted Pyridin-3-amine Derivatives as Multitargeted Protein Kinase Inhibitors for the Treatment of Non-Small Cell Lung Cancer. J Med Chem60:6018-6035 (2017) 
 
Fibroblast growth factor receptor 2
Name:Fibroblast growth factor receptor 2
Type:Enzyme
Mol. Mass.:92015.45
Organism:Homo sapiens (Human)
Description:P21802
Residue:821
BDBM50240781
NameBDBM50240781
Synonyms:CHEMBL4105329
TypeSmall organic molecule
Emp. Form.C27H23ClN4O2
Mol. Mass.470.95
SMILESCc1n[nH]c2ccc(cc12)-c1cc(N[C@@H](CO)c2ccccc2)cnc1-c1cc(Cl)ccc1O