Reaction Details
TargetProto-oncogene tyrosine-protein kinase ROS
LigandBDBM50240780
Substrate/Competitorn/a
Meas. Tech.ChEMBL_1668758 (CHEMBL4018646)
IC50>1000±n/a nM
Citation Zhu, WChen, HWang, YWang, JPeng, XChen, XGao, YLi, CHe, YAi, JGeng, MZheng, MLiu, H Design, Synthesis, and Pharmacological Evaluation of Novel Multisubstituted Pyridin-3-amine Derivatives as Multitargeted Protein Kinase Inhibitors for the Treatment of Non-Small Cell Lung Cancer. J Med Chem60:6018-6035 (2017) 
 
Proto-oncogene tyrosine-protein kinase ROS
Name:Proto-oncogene tyrosine-protein kinase ROS
Type:Enzyme
Mol. Mass.:263897.39
Organism:Homo sapiens (Human)
Description:P08922
Residue:2347
BDBM50240780
NameBDBM50240780
Synonyms:CHEMBL4062877
TypeSmall organic molecule
Emp. Form.C27H23FN4O2
Mol. Mass.454.4955
SMILESCc1n[nH]c2ccc(cc12)-c1cc(N[C@@H](CO)c2ccccc2)cnc1-c1cc(F)ccc1O