Reaction Details
TargetDiscoidin domain-containing receptor 2
LigandBDBM50240780
Substrate/Competitorn/a
Meas. Tech.ChEMBL_1668745 (CHEMBL4018633)
IC50 0.800000±n/a nM
Citation Zhu, WChen, HWang, YWang, JPeng, XChen, XGao, YLi, CHe, YAi, JGeng, MZheng, MLiu, H Design, Synthesis, and Pharmacological Evaluation of Novel Multisubstituted Pyridin-3-amine Derivatives as Multitargeted Protein Kinase Inhibitors for the Treatment of Non-Small Cell Lung Cancer. J Med Chem60:6018-6035 (2017) 
 
Discoidin domain-containing receptor 2
Name:Discoidin domain-containing receptor 2
Type:Protein
Mol. Mass.:96717.07
Organism:Homo sapiens (Human)
Description:Q16832
Residue:855
BDBM50240780
NameBDBM50240780
Synonyms:CHEMBL4062877
TypeSmall organic molecule
Emp. Form.C27H23FN4O2
Mol. Mass.454.4955
SMILESCc1n[nH]c2ccc(cc12)-c1cc(N[C@@H](CO)c2ccccc2)cnc1-c1cc(F)ccc1O