Reaction Details
TargetFibroblast growth factor receptor 1
LigandBDBM50240805
Substrate/Competitorn/a
Meas. Tech.ChEMBL_1668737 (CHEMBL4018625)
IC50 15±n/a nM
Citation Zhu, WChen, HWang, YWang, JPeng, XChen, XGao, YLi, CHe, YAi, JGeng, MZheng, MLiu, H Design, Synthesis, and Pharmacological Evaluation of Novel Multisubstituted Pyridin-3-amine Derivatives as Multitargeted Protein Kinase Inhibitors for the Treatment of Non-Small Cell Lung Cancer. J Med Chem60:6018-6035 (2017) 
 
Fibroblast growth factor receptor 1
Name:Fibroblast growth factor receptor 1
Type:Receptor
Mol. Mass.:91861.70
Organism:Homo sapiens (Human)
Description:P11362
Residue:822
BDBM50240805
NameBDBM50240805
Synonyms:CHEMBL4073545
TypeSmall organic molecule
Emp. Form.C27H24N4O2
Mol. Mass.436.5051
SMILESCc1n[nH]c2ccc(cc12)-c1cc(N[C@@H](CO)c2ccccc2)cnc1-c1ccccc1O