Reaction Details
TargetAdenosine receptor A3
LigandBDBM50304635
Substrate/Competitorn/a
Meas. Tech.ChEBML_1669043
Ki 0.420000±n/a nM
Citation Yu, JAhn, SKim, HJLee, MAhn, SKim, JJin, SHLee, EKim, GCheong, JHJacobson, KAJeong, LSNoh, M Polypharmacology of N J Med Chem60:7459-7475 (2017) 
 
Adenosine receptor A3
Name:Adenosine receptor A3
Type:G Protein-Coupled Receptor (GPCR)
Mol. Mass.:36197.32
Organism:Homo sapiens (Human)
Description:P0DMS8
Residue:318
BDBM50304635
NameBDBM50304635
Synonyms:9-(5'-Ethylaminocarbonyl-4-thio-beta-D-ribofuranosyl)-N6-(3-iodo-benzyl)adenine | CHEMBL596042
TypeSmall organic molecule
Emp. Form.C19H21IN6O3S
Mol. Mass.540.378
SMILESCCNC(=O)[C@H]1S[C@H]([C@H](O)[C@@H]1O)n1cnc2c(NCc3cccc(I)c3)ncnc12