Reaction Details
TargetAdenosine receptor A3
LigandBDBM50252829
Substrate/Competitorn/a
Meas. Tech.ChEBML_1669043
Ki 0.300000±n/a nM
Citation Yu, JAhn, SKim, HJLee, MAhn, SKim, JJin, SHLee, EKim, GCheong, JHJacobson, KAJeong, LSNoh, M Polypharmacology of N J Med Chem60:7459-7475 (2017) 
 
Adenosine receptor A3
Name:Adenosine receptor A3
Type:G Protein-Coupled Receptor (GPCR)
Mol. Mass.:36197.32
Organism:Homo sapiens (Human)
Description:P0DMS8
Residue:318
BDBM50252829
NameBDBM50252829
Synonyms:(2S,3S,4R,5R)-5-(6-(3-iodobenzylamino)-9H-purin-9-yl)-3,4-dihydroxy-N-methyl-tetrahydrothiophene-2-carboxamide N6-(3-Iodo-benzyl)-9-(5'-methylaminocarbonyl-4'-thiobeta-D-ribofuranosyl)adenine
TypeSmall organic molecule
Emp. Form.C18H19IN6O3S
Mol. Mass.526.351
SMILESCNC(=O)[C@H]1S[C@H]([C@H](O)[C@@H]1O)n1cnc2c(NCc3cccc(I)c3)ncnc12