Reaction Details
TargetAdenosine receptor A3
LigandBDBM50214981
Substrate/Competitorn/a
Meas. Tech.ChEMBL_1669043 (CHEMBL4018931)
Ki 1.7±n/a nM
Citation Yu, JAhn, SKim, HJLee, MAhn, SKim, JJin, SHLee, EKim, GCheong, JHJacobson, KAJeong, LSNoh, M Polypharmacology of N J Med Chem60:7459-7475 (2017) 
 
Adenosine receptor A3
Name:Adenosine receptor A3
Type:G Protein-Coupled Receptor (GPCR)
Mol. Mass.:36197.32
Organism:Homo sapiens (Human)
Description:P0DMS8
Residue:318
BDBM50214981
NameBDBM50214981
Synonyms:(2R,3R,4S)-2-(2-chloro-6-(3-chlorobenzylamino)-9H-purin-9-yl)tetrahydrothiophene-3,4-diol CHEMBL387921
TypeSmall organic molecule
Emp. Form.C16H15Cl2N5O2S
Mol. Mass.412.294
SMILESO[C@@H]1CS[C@H]([C@@H]1O)n1cnc2c(NCc3cccc(Cl)c3)nc(Cl)nc12