Reaction Details
TargetHeat shock protein 75 kDa, mitochondrial
LigandBDBM20800
Substrate/Competitorn/a
Meas. Tech.ChEMBL_1669207 (CHEMBL4019095)
IC50 535±n/a nM
Citation Park, HKJeong, HKo, ELee, GLee, JELee, SKLee, AJIm, JYHu, SKim, SHLee, JHLee, CKang, SKang, BH Paralog Specificity Determines Subcellular Distribution, Action Mechanism, and Anticancer Activity of TRAP1 Inhibitors. J Med Chem60:7569-7578 (2017) 
 
Heat shock protein 75 kDa, mitochondrial
Name:Heat shock protein 75 kDa, mitochondrial
Type:PROTEIN
Mol. Mass.:80120.13
Organism:Homo sapiens (Human)
Description:ChEMBL_1478164
Residue:704
BDBM20800
NameBDBM20800
Synonyms:2-amino-6-halopurine analogue, 20 CHEMBL467399 | hsp90_107
TypeSmall organic molecule
Emp. Form.C14H15ClN6O
Mol. Mass.318.762
SMILESCOc1c(C)cnc(Cn2cnc3c(Cl)nc(N)nc23)c1C