Reaction Details
TargetD(2) dopamine receptor
LigandBDBM50001782
Substrate/Competitorn/a
Meas. Tech.ChEBML_61406
IC50 130±n/a nM
Citation Andersen, KPerregaard, JArnt, JNielsen, JBBegtrup, M Selective, centrally acting serotonin 5-HT2 antagonists. 2. Substituted 3-(4-fluorophenyl)-1H-indoles. J Med Chem35:4823-31 (1993) D(2) dopamine receptor
Name:D(2) dopamine receptor
Type:G Protein-Coupled Receptor (GPCR)
Mol. Mass.:50931.60
Organism:Rattus norvegicus (rat)
Description:P61169
Residue:444
BDBM50001782
NameBDBM50001782
Synonyms:(Lu 26-042)1-(2-{4-[6-Chloro-1-(4-fluoro-phenyl)-1H-indol-3-yl]-piperidin-1-yl}-ethyl)-3-isopropyl-imidazolidin-2-one CHEMBL331545
TypeSmall organic molecule
Emp. Form.C27H32ClFN4O
Mol. Mass.483.021
SMILESCC(C)N1CCN(CCN2CCC(CC2)c2cn(-c3ccc(F)cc3)c3cc(Cl)ccc23)C1=O